Deployment Architecture

Error "Search auto-canceled" after upgrading to OEL7

shreya17
Explorer

I am getting an error **"Search auto-canceled"**  after upgrading to OEL7 on search file.

error search.PNG

05-18-2021 14:15:40.913 INFO LocalCollector - Final required fields list = EventData_Xml,Failure_Information,HOST_NAME,INSTANCE_NAME,Message,RenderingInfo_Xml,ServerName,System_Props_Xml,_bkt,_cd,_raw,_si,_subsecond,database_instance,host,index,linecount,source,sourcetype,splunk_server
05-18-2021 14:15:40.913 INFO UserManager - Unwound user context: elon.musk -> NULL
05-18-2021 14:15:40.913 INFO UserManager - Setting user context: elon.musk
05-18-2021 14:15:40.913 INFO UserManager - Done setting user context: NULL -> elon.musk
05-18-2021 14:15:40.913 INFO UserManager - Unwound user context: elon.musk -> NULL
05-18-2021 14:15:40.918 INFO TimelineCreator - Commit timeline at cursor=2147483647.000000
05-18-2021 14:15:41.210 INFO ReducePhaseExecutor - ReducePhaseExecutor=1 action=CANCEL
05-18-2021 14:15:41.210 INFO DispatchExecutor - User applied action=CANCEL while status=0
05-18-2021 14:15:41.210 ERROR SearchStatusEnforcer - sid:1621311338.53671 Search auto-canceled
05-18-2021 14:15:41.210 INFO SearchStatusEnforcer - State changed to FAILED due to: Search auto-canceled
05-18-2021 14:15:41.246 INFO TimelineCreator - Commit timeline at cursor=1621311335.000000
05-18-2021 14:15:41.282 WARN DownloadRemoteDataTransaction - Got status code: 404 ( Not Found) from https://10.18.271.155:8180/services/search/jobs/remote_google.com_16213012338.53671/search_telemetry...
05-18-2021 14:15:41.282 WARN DownloadRemoteDataTransaction - Failed to download search.log from remote peer 'google.com', uri='https://10.18.271.155:8180', sid='remote_google.com_16213012338.53671'
05-18-2021 14:15:41.283 INFO ReducePhaseExecutor - Downloading all remote search.log / search_telemetry.json files took 0.037 seconds
05-18-2021 14:15:41.283 INFO ReducePhaseExecutor - Ending phase_1
05-18-2021 14:15:41.283 INFO UserManager - Unwound user context: elon.musk -> NULL
05-18-2021 14:15:41.283 ERROR SearchOrchestrator - Phase_1 failed due to : DAG Execution Exception: Search has been cancelled
05-18-2021 14:15:41.285 INFO ReducePhaseExecutor - ReducePhaseExecutor=1 action=CANCEL
05-18-2021 14:15:41.285 INFO DispatchExecutor - User applied action=CANCEL while status=3
05-18-2021 14:15:41.288 INFO DispatchStorageManager - Remote storage disabled for search artifacts.
05-18-2021 14:15:41.288 INFO DispatchManager - DispatchManager::dispatchHasFinished(id='16213012338.53671', username='elon.musk')
05-18-2021 14:15:41.289 INFO UserManager - Unwound user context: elon.musk -> NULL
05-18-2021 14:15:41.302 INFO UserManager - Unwound user context: elon.musk -> NULL
05-18-2021 14:15:42.301 INFO UserManager - Unwound user context: elon.musk -> NULL
05-18-2021 14:15:42.325 INFO UserManager - Unwound user context: elon.musk -> NULL
05-18-2021 14:15:42.338 ERROR dispatchRunner - RunDispatch::runDispatchThread threw error: DAG Execution Exception: Search has been cancelled

Get Updates on the Splunk Community!

.conf24 | Day 0

Hello Splunk Community! My name is Chris, and I'm based in Canberra, Australia's capital, and I travelled for ...

Enhance Security Visibility with Splunk Enterprise Security 7.1 through Threat ...

(view in My Videos)Struggling with alert fatigue, lack of context, and prioritization around security ...

Troubleshooting the OpenTelemetry Collector

  In this tech talk, you’ll learn how to troubleshoot the OpenTelemetry collector - from checking the ...