All Apps and Add-ons

Why does Splunk MINT fail to install on Android Studio?

cesquivias
New Member

I upgraded to the latest version of Splunk MINT for Android (v5.2.1) and the project builds but when I try to install the app I get a generic error

:project:transformClassesWithMintForProductionDebug
:project:transformClassesWithExtractJarsForProductionDebug
FAILED

FAILURE: Build failed with an
exception.

  • What went wrong: Execution failed for task ':project:transformClassesWithExtractJarsForProductionDebug'. > error

It looks like MINT is trying to do something with the Jar files and failing. What's the problem and how do I get passed it?

The gradle output with --stacktrace

:project:transformClassesWithExtractJarsForProductionDebug
FAILED

FAILURE: Build failed with an
exception.

  • What went wrong: Execution failed for task
    ':project:transformClassesWithExtractJarsForProductionDebug'.

    error

  • Try: Run with --info or --debug option to get more log output.

  • Exception is: org.gradle.api.tasks.TaskExecutionException:
    Execution failed for task
    ':nFarmers:transformClassesWithExtractJarsForProductionDebug'.
    at
    org.gradle.api.internal.tasks.execution.ExecuteActionsTaskExecuter.executeActions(ExecuteActionsTaskExecuter.java:84)
    at
    org.gradle.api.internal.tasks.execution.ExecuteActionsTaskExecuter.execute(ExecuteActionsTaskExecuter.java:55)
    at
    org.gradle.api.internal.tasks.execution.SkipUpToDateTaskExecuter.execute(SkipUpToDateTaskExecuter.java:61)
    at
    org.gradle.api.internal.tasks.execution.ValidatingTaskExecuter.execute(ValidatingTaskExecuter.java:58)
    at
    org.gradle.api.internal.tasks.execution.SkipEmptySourceFilesTaskExecuter.execute(SkipEmptySourceFilesTaskExecuter.java:88)
    at
    org.gradle.api.internal.tasks.execution.ResolveTaskArtifactStateTaskExecuter.execute(ResolveTaskArtifactStateTaskExecuter.java:45)
    at
    org.gradle.api.internal.tasks.execution.SkipTaskWithNoActionsExecuter.execute(SkipTaskWithNoActionsExecuter.java:51)
    at
    org.gradle.api.internal.tasks.execution.SkipOnlyIfTaskExecuter.execute(SkipOnlyIfTaskExecuter.java:54)
    at
    org.gradle.api.internal.tasks.execution.ExecuteAtMostOnceTaskExecuter.execute(ExecuteAtMostOnceTaskExecuter.java:43)
    at
    org.gradle.api.internal.tasks.execution.CatchExceptionTaskExecuter.execute(CatchExceptionTaskExecuter.java:34)
    at
    org.gradle.execution.taskgraph.DefaultTaskGraphExecuter$EventFiringTaskWorker.execute(DefaultTaskGraphExecuter.java:233)
    at
    org.gradle.execution.taskgraph.DefaultTaskGraphExecuter$EventFiringTaskWorker.execute(DefaultTaskGraphExecuter.java:215)
    at
    org.gradle.execution.taskgraph.AbstractTaskPlanExecutor$TaskExecutorWorker.processTask(AbstractTaskPlanExecutor.java:74)
    at
    org.gradle.execution.taskgraph.AbstractTaskPlanExecutor$TaskExecutorWorker.run(AbstractTaskPlanExecutor.java:55)
    at
    org.gradle.execution.taskgraph.DefaultTaskPlanExecutor.process(DefaultTaskPlanExecutor.java:32)
    at
    org.gradle.execution.taskgraph.DefaultTaskGraphExecuter.execute(DefaultTaskGraphExecuter.java:113)
    at
    org.gradle.execution.SelectedTaskExecutionAction.execute(SelectedTaskExecutionAction.java:37)
    at
    org.gradle.execution.DefaultBuildExecuter.execute(DefaultBuildExecuter.java:37)
    at
    org.gradle.execution.DefaultBuildExecuter.access$000(DefaultBuildExecuter.java:23)
    at
    org.gradle.execution.DefaultBuildExecuter$1.proceed(DefaultBuildExecuter.java:43)
    at
    org.gradle.execution.DryRunBuildExecutionAction.execute(DryRunBuildExecutionAction.java:32)
    at
    org.gradle.execution.DefaultBuildExecuter.execute(DefaultBuildExecuter.java:37)
    at
    org.gradle.execution.DefaultBuildExecuter.execute(DefaultBuildExecuter.java:30)
    at
    org.gradle.initialization.DefaultGradleLauncher$4.run(DefaultGradleLauncher.java:197)
    at
    org.gradle.internal.Factories$1.create(Factories.java:25)
    at
    org.gradle.internal.progress.DefaultBuildOperationExecutor.run(DefaultBuildOperationExecutor.java:91)
    at
    org.gradle.internal.progress.DefaultBuildOperationExecutor.run(DefaultBuildOperationExecutor.java:53)
    at
    org.gradle.initialization.DefaultGradleLauncher.doBuildStages(DefaultGradleLauncher.java:194)
    at
    org.gradle.initialization.DefaultGradleLauncher.access$200(DefaultGradleLauncher.java:36)
    at
    org.gradle.initialization.DefaultGradleLauncher$1.create(DefaultGradleLauncher.java:118)
    at
    org.gradle.initialization.DefaultGradleLauncher$1.create(DefaultGradleLauncher.java:112)
    at
    org.gradle.internal.progress.DefaultBuildOperationExecutor.run(DefaultBuildOperationExecutor.java:91)
    at
    org.gradle.internal.progress.DefaultBuildOperationExecutor.run(DefaultBuildOperationExecutor.java:63)
    at
    org.gradle.initialization.DefaultGradleLauncher.doBuild(DefaultGradleLauncher.java:112)
    at
    org.gradle.initialization.DefaultGradleLauncher.run(DefaultGradleLauncher.java:98)
    at
    org.gradle.launcher.exec.GradleBuildController.run(GradleBuildController.java:66)
    at
    org.gradle.tooling.internal.provider.runner.BuildModelActionRunner.run(BuildModelActionRunner.java:52)
    at
    org.gradle.launcher.exec.ChainingBuildActionRunner.run(ChainingBuildActionRunner.java:35)
    at
    org.gradle.tooling.internal.provider.runner.SubscribableBuildActionRunner.run(SubscribableBuildActionRunner.java:58)
    at
    org.gradle.launcher.exec.ChainingBuildActionRunner.run(ChainingBuildActionRunner.java:35)
    at
    org.gradle.launcher.exec.InProcessBuildActionExecuter.execute(InProcessBuildActionExecuter.java:41)
    at
    org.gradle.launcher.exec.InProcessBuildActionExecuter.execute(InProcessBuildActionExecuter.java:26)
    at
    org.gradle.tooling.internal.provider.ContinuousBuildActionExecuter.execute(ContinuousBuildActionExecuter.java:75)
    at
    org.gradle.tooling.internal.provider.ContinuousBuildActionExecuter.execute(ContinuousBuildActionExecuter.java:49)
    at
    org.gradle.tooling.internal.provider.ServicesSetupBuildActionExecuter.execute(ServicesSetupBuildActionExecuter.java:44)
    at
    org.gradle.tooling.internal.provider.ServicesSetupBuildActionExecuter.execute(ServicesSetupBuildActionExecuter.java:29)
    at
    org.gradle.launcher.daemon.server.exec.ExecuteBuild.doBuild(ExecuteBuild.java:67)
    at
    org.gradle.launcher.daemon.server.exec.BuildCommandOnly.execute(BuildCommandOnly.java:36)
    at
    org.gradle.launcher.daemon.server.api.DaemonCommandExecution.proceed(DaemonCommandExecution.java:120)
    at
    org.gradle.launcher.daemon.server.exec.WatchForDisconnection.execute(WatchForDisconnection.java:47)
    at
    org.gradle.launcher.daemon.server.api.DaemonCommandExecution.proceed(DaemonCommandExecution.java:120)
    at
    org.gradle.launcher.daemon.server.exec.ResetDeprecationLogger.execute(ResetDeprecationLogger.java:26)
    at
    org.gradle.launcher.daemon.server.api.DaemonCommandExecution.proceed(DaemonCommandExecution.java:120)
    at
    org.gradle.launcher.daemon.server.exec.RequestStopIfSingleUsedDaemon.execute(RequestStopIfSingleUsedDaemon.java:34)
    at
    org.gradle.launcher.daemon.server.api.DaemonCommandExecution.proceed(DaemonCommandExecution.java:120)
    at
    org.gradle.launcher.daemon.server.exec.ForwardClientInput$2.call(ForwardClientInput.java:74)
    at
    org.gradle.launcher.daemon.server.exec.ForwardClientInput$2.call(ForwardClientInput.java:72)
    at
    org.gradle.util.Swapper.swap(Swapper.java:38)
    at
    org.gradle.launcher.daemon.server.exec.ForwardClientInput.execute(ForwardClientInput.java:72)
    at
    org.gradle.launcher.daemon.server.api.DaemonCommandExecution.proceed(DaemonCommandExecution.java:120)
    at
    org.gradle.launcher.daemon.server.exec.LogAndCheckHealth.execute(LogAndCheckHealth.java:55)
    at
    org.gradle.launcher.daemon.server.api.DaemonCommandExecution.proceed(DaemonCommandExecution.java:120)
    at
    org.gradle.launcher.daemon.server.exec.LogToClient.doBuild(LogToClient.java:60)
    at
    org.gradle.launcher.daemon.server.exec.BuildCommandOnly.execute(BuildCommandOnly.java:36)
    at
    org.gradle.launcher.daemon.server.api.DaemonCommandExecution.proceed(DaemonCommandExecution.java:120)
    at
    org.gradle.launcher.daemon.server.exec.EstablishBuildEnvironment.doBuild(EstablishBuildEnvironment.java:72)
    at
    org.gradle.launcher.daemon.server.exec.BuildCommandOnly.execute(BuildCommandOnly.java:36)
    at
    org.gradle.launcher.daemon.server.api.DaemonCommandExecution.proceed(DaemonCommandExecution.java:120)
    at
    org.gradle.launcher.daemon.server.exec.StartBuildOrRespondWithBusy$1.run(StartBuildOrRespondWithBusy.java:50)
    at
    org.gradle.launcher.daemon.server.DaemonStateCoordinator$1.run(DaemonStateCoordinator.java:293) at
    org.gradle.internal.concurrent.ExecutorPolicy$CatchAndRecordFailures.onExecute(ExecutorPolicy.java:54)
    at
    org.gradle.internal.concurrent.StoppableExecutorImpl$1.run(StoppableExecutorImpl.java:40)
    Caused by: java.lang.RuntimeException:
    error at
    com.android.build.gradle.internal.pipeline.IntermediateFolderUtils.parseScopeLevelFolders(IntermediateFolderUtils.java:444)
    at
    com.android.build.gradle.internal.pipeline.IntermediateFolderUtils.parseTypeLevelFolders(IntermediateFolderUtils.java:411)
    at
    com.android.build.gradle.internal.pipeline.IntermediateFolderUtils.computeNonIncrementalInputFromFolder(IntermediateFolderUtils.java:116)
    at
    com.android.build.gradle.internal.pipeline.IntermediateStream.asNonIncrementalInput(IntermediateStream.java:132)
    at
    com.android.build.gradle.internal.pipeline.TransformTask.computeNonIncTransformInput(TransformTask.java:246)
    at
    com.android.build.gradle.internal.pipeline.TransformTask.access$500(TransformTask.java:66)
    at
    com.android.build.gradle.internal.pipeline.TransformTask$1.call(TransformTask.java:155)
    at
    com.android.build.gradle.internal.pipeline.TransformTask$1.call(TransformTask.java:118)
    at
    com.android.builder.profile.ThreadRecorder.record(ThreadRecorder.java:156)
    at
    com.android.build.gradle.internal.pipeline.TransformTask.transform(TransformTask.java:117)
    at
    org.gradle.internal.reflect.JavaMethod.invoke(JavaMethod.java:73)
    at
    org.gradle.api.internal.project.taskfactory.DefaultTaskClassInfoStore$IncrementalTaskAction.doExecute(DefaultTaskClassInfoStore.java:163)
    at
    org.gradle.api.internal.project.taskfactory.DefaultTaskClassInfoStore$StandardTaskAction.execute(DefaultTaskClassInfoStore.java:134)
    at
    org.gradle.api.internal.project.taskfactory.DefaultTaskClassInfoStore$StandardTaskAction.execute(DefaultTaskClassInfoStore.java:123)
    at
    org.gradle.api.internal.tasks.execution.ExecuteActionsTaskExecuter.executeAction(ExecuteActionsTaskExecuter.java:95)
    at
    org.gradle.api.internal.tasks.execution.ExecuteActionsTaskExecuter.executeActions(ExecuteActionsTaskExecuter.java:76)
    ... 71 more

0 Karma

ibmmbaraka
Explorer

any luck with this issue?

0 Karma

ibmmbaraka
Explorer

I got the older version from the link http://download.splunk.com/misc/mint/mint-android-repo-5.1.0.zip
and used check their installation https://www.youtube.com/watch?v=vecdk2HUASw, at least it can build, so i believe that 5.2 version has an issue

croyal_splunk
Splunk Employee
Splunk Employee

Will you build with the following flag "--stacktrace"? That should print out a verbose stacktrace of the error, so we can better troubleshoot your issue.

(Step-by-step for latest SDK: http://docs.splunk.com/Documentation/MintAndroidSDK/5.2.x/DevGuide/Requirementsandinstallation)

0 Karma

cesquivias
New Member

Added the gradle stacktrace to question

0 Karma

ibmmbaraka
Explorer

Any luck with this problem?

0 Karma

croyal_splunk
Splunk Employee
Splunk Employee

I sent you an email with followup questions/suggestions. Please reply so we can resolve your issue. Thanks.

0 Karma
Get Updates on the Splunk Community!

Extending Observability Content to Splunk Cloud

Watch Now!   In this Extending Observability Content to Splunk Cloud Tech Talk, you'll see how to leverage ...

More Control Over Your Monitoring Costs with Archived Metrics!

What if there was a way you could keep all the metrics data you need while saving on storage costs?This is now ...

New in Observability Cloud - Explicit Bucket Histograms

Splunk introduces native support for histograms as a metric data type within Observability Cloud with Explicit ...